Target
Mitogen-activated protein kinase kinase kinase 12
Ligand
BDBM365234
Substrate
Meas. Tech.
TR-FRET assay
Ki
59.0±n/a nM
Citation
 Cohen, FPatel, S C-linked heterocycloaklyl substituted pyrimidines and their uses US Patent  US9868720 Publication Date 1/16/2018 
Target
Name:
Mitogen-activated protein kinase kinase kinase 12
Synonyms:
DLK Leucine-zipper protein kinase MAP3K12 MUK Mixed lineage kinase | ZPK
Type:
PROTEIN
Mol. Mass.:
93216.56
Organism:
Homo sapiens (Human)
Description:
ChEMBL_1460553
Residue:
859
  
Inhibitor
Name:
BDBM365234
Synonyms:
1-{3-[6-(4-Methyl-pyridin- 2-ylamino)-2-pyrrolidin- 1-yl-pyrimidin-4-yl]- pyrrolidin-1-yl}-ethanone | US9868720, No. 89
Type:
Small organic molecule
Emp. Form.:
C20H26N6O
Mol. Mass.:
366.46
SMILES:
CC(=O)N1CCC(C1)c1cc(Nc2cc(C)ccn2)nc(n1)N1CCCC1
: