Target
Mitogen-activated protein kinase kinase kinase 12
Ligand
BDBM365291
Substrate
Meas. Tech.
TR-FRET assay
Ki
36.8±n/a nM
Citation
 Cohen, FPatel, S C-linked heterocycloaklyl substituted pyrimidines and their uses US Patent  US9868720 Publication Date 1/16/2018 
Target
Name:
Mitogen-activated protein kinase kinase kinase 12
Synonyms:
DLK Leucine-zipper protein kinase MAP3K12 MUK Mixed lineage kinase | ZPK
Type:
PROTEIN
Mol. Mass.:
93216.56
Organism:
Homo sapiens (Human)
Description:
ChEMBL_1460553
Residue:
859
  
Inhibitor
Name:
BDBM365291
Synonyms:
US9868720, No. 385 | [2-Cyclopentyl-6-(1- methanesulfonyl-piperidin- 3-yl)-pyrimidin-4-yl]- (4-trifluoromethyl- pyridin-2-yl)-amine
Type:
Small organic molecule
Emp. Form.:
C21H26F3N5O2S
Mol. Mass.:
469.524
SMILES:
CS(=O)(=O)N1CCCC(C1)c1cc(Nc2cc(ccn2)C(F)(F)F)nc(n1)C1CCCC1
: