Target
Mitogen-activated protein kinase kinase kinase 12
Ligand
BDBM365299
Substrate
Meas. Tech.
TR-FRET assay
Ki
26.0±n/a nM
Citation
 Cohen, FPatel, S C-linked heterocycloaklyl substituted pyrimidines and their uses US Patent  US9868720 Publication Date 1/16/2018 
Target
Name:
Mitogen-activated protein kinase kinase kinase 12
Synonyms:
DLK Leucine-zipper protein kinase MAP3K12 MUK Mixed lineage kinase | ZPK
Type:
PROTEIN
Mol. Mass.:
93216.56
Organism:
Homo sapiens (Human)
Description:
ChEMBL_1460553
Residue:
859
  
Inhibitor
Name:
BDBM365299
Synonyms:
US9868720, No. 407 | [2-Cyclobutyl-6-(1-oxetan- 3-yl-piperidin-3-yl)- pyrimidin-4-yl]-(4-trifluoro- methyl-pyridin-2-yl)-amine
Type:
Small organic molecule
Emp. Form.:
C22H26F3N5O
Mol. Mass.:
433.4699
SMILES:
FC(F)(F)c1ccnc(Nc2cc(nc(n2)C2CCC2)C2CCCN(C2)C2COC2)c1
: