Target
Platelet-derived growth factor receptor beta
Ligand
BDBM364991
Substrate
Meas. Tech.
Biochemical Assay
IC50
15.0±n/a nM
Citation
 Boral, SMalone, TCWang, S Pyridyl benzothiophenes as kinase inhibitors US Patent  US9868726 Publication Date 1/16/2018 
Target
Name:
Platelet-derived growth factor receptor beta
Synonyms:
Beta-type platelet-derived growth factor receptor CD140b antigen PDGF Receptor Substrate PDGFR PDGFR-1 PDGFRB PGFRB_HUMAN Platelet-derived growth factor receptor 1 Platelet-derived growth factor receptor beta (PDGFR-beta) Platelet-derived growth factor receptor beta (PDGFRbeta) | VHL/PDGFRB
Type:
Enzyme
Mol. Mass.:
123922.25
Organism:
Homo sapiens (Human)
Description:
P09619
Residue:
1106
  
Inhibitor
Name:
BDBM364991
Synonyms:
US10633373, Example 9 US9868726, Example 9 | methyl 6-amino-5-{5-[({[4- chloro-3- (trifluoromethyl)phenyl]amino} carbonyl)amino]-1- benzothien-2-yl}nicotinate
Type:
Small organic molecule
Emp. Form.:
C23H16ClF3N4O3S
Mol. Mass.:
520.911
SMILES:
COC(=O)c1cnc(N)c(c1)-c1cc2cc(NC(=O)Nc3ccc(Cl)c(c3)C(F)(F)F)ccc2s1
: