Target
Platelet-derived growth factor receptor beta
Ligand
BDBM365013
Substrate
Meas. Tech.
Biochemical Assay
IC50
10.00±n/a nM
Citation
 Boral, SMalone, TCWang, S Pyridyl benzothiophenes as kinase inhibitors US Patent  US9868726 Publication Date 1/16/2018 
Target
Name:
Platelet-derived growth factor receptor beta
Synonyms:
Beta-type platelet-derived growth factor receptor CD140b antigen PDGF Receptor Substrate PDGFR PDGFR-1 PDGFRB PGFRB_HUMAN Platelet-derived growth factor receptor 1 Platelet-derived growth factor receptor beta (PDGFR-beta) Platelet-derived growth factor receptor beta (PDGFRbeta) | VHL/PDGFRB
Type:
Enzyme
Mol. Mass.:
123922.25
Organism:
Homo sapiens (Human)
Description:
P09619
Residue:
1106
  
Inhibitor
Name:
BDBM365013
Synonyms:
1-{2-[2-amino-5-(4,4,5,5- tetramethyl-1,3,2- dioxaborolan-2-yl)pyridin-3- yl]-1-benzothien-5-yl}-3-[2- fluoro-5- (trifluoromethyl)phenyl]urea US10669265, Example 23 | US9868726, Example 23
Type:
Small organic molecule
Emp. Form.:
C27H25BF4N4O3S
Mol. Mass.:
572.382
SMILES:
CC1(C)OB(OC1(C)C)c1cnc(N)c(c1)-c1cc2cc(NC(=O)Nc3cc(ccc3F)C(F)(F)F)ccc2s1
: