Target
Platelet-derived growth factor receptor beta
Ligand
BDBM365349
Substrate
Meas. Tech.
Biochemical Assay
IC50
3.00±n/a nM
Citation
 Boral, SMalone, TCWang, S Pyridyl benzothiophenes as kinase inhibitors US Patent  US9868726 Publication Date 1/16/2018 
Target
Name:
Platelet-derived growth factor receptor beta
Synonyms:
Beta-type platelet-derived growth factor receptor CD140b antigen PDGF Receptor Substrate PDGFR PDGFR-1 PDGFRB PGFRB_HUMAN Platelet-derived growth factor receptor 1 Platelet-derived growth factor receptor beta (PDGFR-beta) Platelet-derived growth factor receptor beta (PDGFRbeta) | VHL/PDGFRB
Type:
Enzyme
Mol. Mass.:
123922.25
Organism:
Homo sapiens (Human)
Description:
P09619
Residue:
1106
  
Inhibitor
Name:
BDBM365349
Synonyms:
US10633373, Example 54 US9868726, Example 54 | methyl 5-[N-({6-amino-5-[5- ({[(2-fluoro-5- methylphenyl)amino]carbonyl} amino)-1-benzothien-2- yl]pyridin-3-yl}carbonyl)-S- methylsulfonimidoyl]pentanoate
Type:
Small organic molecule
Emp. Form.:
C29H30FN5O5S2
Mol. Mass.:
611.707
SMILES:
COC(=O)CCCC[S@](C)(=O)=NC(=O)c1cnc(N)c(c1)-c1cc2cc(NC(=O)Nc3cc(C)ccc3F)ccc2s1
: