Target
Tyrosine-protein kinase SYK
Ligand
BDBM365500
Substrate
Meas. Tech.
In Vitro Assay
IC50
55±n/a nM
Citation
 Bauer, SMPandey, A Inhibitors of protein kinases US Patent  US9868729 Publication Date 1/16/2018 
Target
Name:
Tyrosine-protein kinase SYK
Synonyms:
KSYK_HUMAN Spleen Tyrosine Kinase Tyrosine-protein kinase SYK (Syk)
Type:
Enzyme
Mol. Mass.:
72079.99
Organism:
Homo sapiens (Human)
Description:
P43405
Residue:
635
  
Inhibitor
Name:
BDBM365500
Synonyms:
US10533001, Example 216 US9868729, Example 216
Type:
Small organic molecule
Emp. Form.:
C19H19N7O
Mol. Mass.:
361.4005
SMILES:
NC(=O)c1cnc(Nc2ccc(cc2)-c2ccnc(N)c2)nc1NC1CC1
: