Target
Estrogen receptor
Ligand
BDBM20591
Substrate
17beta-estradiol (E2)
Meas. Tech.
ER-alpha Radioligand Binding Assay and ERE-Luciferase Reporter Assay.
pH
7.4±n/a
Temperature
295.15±n/a K
IC50
28±2 nM
EC50
2.9±0.8 nM
Comments
Antagonist activity in MCF-7 assay, IC50= 4.0 +/- 2.7 nM; in the absence of 17beta-estradiol in the MCF-7 proliferation assay, compound displayed 16 +/- 6 % agonistic effect.
Citation
 Renaud, JBischoff, SFBuhl, TFloersheim, PFournier, BHalleux, CKallen, JKeller, HSchlaeppi, JMStark, W Estrogen receptor modulators: identification and structure-activity relationships of potent ERalpha-selective tetrahydroisoquinoline ligands. J Med Chem 46:2945-57 (2003)  
Target
Name:
Estrogen receptor
Synonyms:
ER ESR ESR1_HUMAN Estrogen receptor Estrogen receptor (ER-alpha) Estrogen receptor alpha (ER) Nuclear receptor subfamily 3 group A member 1
Type:
Protein
Mol. Mass.:
66230.44
Organism:
Homo sapiens (Human)
Description:
P03372
Residue:
595
  
Inhibitor
Name:
BDBM20591
Synonyms:
1-methyl-2-(4-methylphenyl)-1-{4-[2-(piperidin-1-yl)ethoxy]phenyl}-1,2,3,4-tetrahydroisoquinolin-6-ol | tetrahydroisoquinoline derivative, 20b
Type:
Small organic molecule
Emp. Form.:
C30H36N2O2
Mol. Mass.:
456.619
SMILES:
Cc1ccc(cc1)N1CCc2cc(O)ccc2C1(C)c1ccc(OCCN2CCCCC2)cc1
:
Substrate
Name:
BDBM17292
Synonyms:
(1S,10R,11S,14S,15S)-15-methyltetracyclo[8.7.0.0^{2,7}.0^{11,15}]heptadeca-2,4,6-triene-5,14-diol 17α-ethinylestradiol CHEMBL135 ESTRADIOL Ovocyclin US9040509, E2 US9561238, E2 [2,4,6,7-3H]-E2 [3H]]estradiol
Type:
Steroid
Emp. Form.:
C18H24O2
Mol. Mass.:
272.382
SMILES:
[H][C@@]12CC[C@H](O)[C@@]1(C)CC[C@]1([H])c3ccc(O)cc3CC[C@@]21[H]
: