Target
Beta-secretase 2
Ligand
BDBM365592
Substrate
Meas. Tech.
Time-Resolved Endpoint Proteolysis aAssay
Ki
24.4±n/a nM
Citation
 Liu, KHe, SCumming, JNStamford, AW Diazine-fused amidines as BACE inhibitors, compositions, and their use US Patent  US9868738 Publication Date 1/16/2018 
Target
Name:
Beta-secretase 2
Synonyms:
AEPLC ASP1 Asp 1 Aspartyl protease 1 BACE2_HUMAN Beta-secretase (BACE) Beta-secretase 2 (BACE-2) Beta-site APP-cleaving enzyme 2 Memapsin-1 beta-Secretase (BACE-2)
Type:
Protein
Mol. Mass.:
56171.20
Organism:
Homo sapiens (Human)
Description:
Q9Y5Z0
Residue:
518
  
Inhibitor
Name:
BDBM365592
Synonyms:
US9868738, Example 28
Type:
Small organic molecule
Emp. Form.:
C21H16ClFN6OS
Mol. Mass.:
454.908
SMILES:
Cc1ncc2C(=N)N[C@@](C)(Cc2n1)c1sc(cc1Cl)-c1cc(F)cc(c1)-c1nnco1
: