Target
Beta-secretase 1
Ligand
BDBM365599
Substrate
Meas. Tech.
HTRF FRET Assay
Ki
224±n/a nM
Citation
 Liu, KHe, SCumming, JNStamford, AW Diazine-fused amidines as BACE inhibitors, compositions, and their use US Patent  US9868738 Publication Date 1/16/2018 
Target
Name:
Beta-secretase 1
Synonyms:
ASP2 Aspartyl protease 2 BACE1 Beta-secretase (BACE) Beta-secretase 1 (BACE 1) Beta-secretase 1 (BACE1) Beta-site amyloid precursor protein cleaving enzyme 1 Memapsin-2 beta-Secretase (BACE-1) | beta-Secretase (BACE1)
Type:
Protein
Mol. Mass.:
55755.10
Organism:
Homo sapiens (Human)
Description:
P56817
Residue:
501
  
Inhibitor
Name:
BDBM365599
Synonyms:
US9868738, Example 35
Type:
Small organic molecule
Emp. Form.:
C21H18N6S
Mol. Mass.:
386.473
SMILES:
C[C@]1(Cc2nc(ncc2C(=N)N1)C1CC1)c1cc(cs1)-c1cncc(c1)C#N
: