Target
Nuclear receptor ROR-gamma
Ligand
BDBM365674
Substrate
Meas. Tech.
Binding Assay
Ki
<100±n/a nM
Citation
 Claremon, DADillard, LWDong, CFan, YJia, LLotesta, SDMarcus, ASingh, SBTice, CMYuan, JZhao, WZheng, YZhuang, L Thiazolopyrrolidine inhibitors of ROR- γ US Patent  US9868748 Publication Date 1/16/2018 
Target
Name:
Nuclear receptor ROR-gamma
Synonyms:
NR1F3 Nuclear receptor ROR-gamma (RORC) RAR-related orphan receptor C (RORc) RORG RZRG Retinoid-related orphan receptor-gamma (RORc)
Type:
Enzyme Catalytic Domain
Mol. Mass.:
58218.40
Organism:
Homo sapiens (Human)
Description:
P51449
Residue:
518
  
Inhibitor
Name:
BDBM365674
Synonyms:
US9868748, I-A61
Type:
Small organic molecule
Emp. Form.:
C26H29F2N3O3S2
Mol. Mass.:
533.654
SMILES:
CCS(=O)(=O)c1ccc(CC(=O)Nc2nc3[C@H](C(C)C)N(Cc4ccc(cc4)C(F)F)Cc3s2)cc1
: