Target
Nuclear receptor ROR-gamma
Ligand
BDBM365710
Substrate
Meas. Tech.
Binding Assay
Ki
>1000±n/a nM
Citation
 Claremon, DADillard, LWDong, CFan, YJia, LLotesta, SDMarcus, ASingh, SBTice, CMYuan, JZhao, WZheng, YZhuang, L Thiazolopyrrolidine inhibitors of ROR- γ US Patent  US9868748 Publication Date 1/16/2018 
Target
Name:
Nuclear receptor ROR-gamma
Synonyms:
NR1F3 Nuclear receptor ROR-gamma (RORC) RAR-related orphan receptor C (RORc) RORG RZRG Retinoid-related orphan receptor-gamma (RORc)
Type:
Enzyme Catalytic Domain
Mol. Mass.:
58218.40
Organism:
Homo sapiens (Human)
Description:
P51449
Residue:
518
  
Inhibitor
Name:
BDBM365710
Synonyms:
US9868748, I-D3
Type:
Small organic molecule
Emp. Form.:
C22H21ClF3N3O2S2
Mol. Mass.:
515.999
SMILES:
CC(C)[C@@H]1N(Cc2ccc(Cl)cc2)Cc2sc(NS(=O)(=O)c3cccc(c3)C(F)(F)F)nc12
: