Target
Nuclear receptor ROR-gamma
Ligand
BDBM365730
Substrate
Meas. Tech.
Binding Assay
Ki
<100±n/a nM
Citation
 Claremon, DADillard, LWDong, CFan, YJia, LLotesta, SDMarcus, ASingh, SBTice, CMYuan, JZhao, WZheng, YZhuang, L Thiazolopyrrolidine inhibitors of ROR- γ US Patent  US9868748 Publication Date 1/16/2018 
Target
Name:
Nuclear receptor ROR-gamma
Synonyms:
NR1F3 Nuclear receptor ROR-gamma (RORC) RAR-related orphan receptor C (RORc) RORG RZRG Retinoid-related orphan receptor-gamma (RORc)
Type:
Enzyme Catalytic Domain
Mol. Mass.:
58218.40
Organism:
Homo sapiens (Human)
Description:
P51449
Residue:
518
  
Inhibitor
Name:
BDBM365730
Synonyms:
US9868748, I-M1
Type:
Small organic molecule
Emp. Form.:
C25H25FN4O3S2
Mol. Mass.:
512.619
SMILES:
CC(C)[C@@H]1N(Cc2ccc(cc2)C#N)Cc2sc(NC(=O)Cc3ccc(cc3F)S(C)(=O)=O)nc12
: