Target
Programmed cell death 1 ligand 1
Ligand
BDBM365899
Substrate
Meas. Tech.
Homogenous Time-Resolved Fluorescence (HTRF) Binding Assay
IC50
53±n/a nM
Citation
 Chupak, LSZheng, X Compounds useful as immunomodulators US Patent  US9872852 Publication Date 1/23/2018 
Target
Name:
Programmed cell death 1 ligand 1
Synonyms:
B7 homolog 1 B7H1 CD274 PD-L1 PDCD1 ligand 1 PDCD1LG1 Programmed cell death 1 ligand 1 | Programmed death ligand 1
Type:
PROTEIN
Mol. Mass.:
33278.49
Organism:
Homo sapiens (Human)
Description:
ChEMBL_109807
Residue:
290
  
Inhibitor
Name:
BDBM365899
Synonyms:
2-(4-{[3-(hydroxymethyl) piperidin-1-yl]methyl}-3,5- dimethoxyphenoxymethyl)-6- phenylbenzonitrile | US9872852, Example 151
Type:
Small organic molecule
Emp. Form.:
C29H32N2O4
Mol. Mass.:
472.5754
SMILES:
COc1cc(OCc2cccc(-c3ccccc3)c2C#N)cc(OC)c1CN1CCCC(CO)C1
: