Target
Programmed cell death 1 ligand 1
Ligand
BDBM366006
Substrate
Meas. Tech.
Homogenous Time-Resolved Fluorescence (HTRF) Binding Assay
IC50
53±n/a nM
Citation
 Chupak, LSZheng, X Compounds useful as immunomodulators US Patent  US9872852 Publication Date 1/23/2018 
Target
Name:
Programmed cell death 1 ligand 1
Synonyms:
B7 homolog 1 B7H1 CD274 PD-L1 PDCD1 ligand 1 PDCD1LG1 Programmed cell death 1 ligand 1 | Programmed death ligand 1
Type:
PROTEIN
Mol. Mass.:
33278.49
Organism:
Homo sapiens (Human)
Description:
ChEMBL_109807
Residue:
290
  
Inhibitor
Name:
BDBM366006
Synonyms:
({2,6-dimethoxy-4-[(2-methyl-3- phenylphenyl)methoxy]phenyl} methyl)[3-(dimethylamino)-2- hydroxypropyl]amine | US9872852, Example 258
Type:
Small organic molecule
Emp. Form.:
C28H36N2O4
Mol. Mass.:
464.5964
SMILES:
COc1cc(OCc2cccc(c2C)-c2ccccc2)cc(OC)c1CNCC(O)CN(C)C
: