Target
P2X purinoceptor 4
Ligand
BDBM366066
Substrate
Meas. Tech.
Inhibition Activity Assay
IC50
3400±n/a nM
Citation
 Sakuma, SKobayashi, KUshioda, MSaito, DImai, TInoue, K P2X4 receptor antagonist US Patent  US9873683 Publication Date 1/23/2018 
Target
Name:
P2X purinoceptor 4
Synonyms:
ATP receptor P2RX4_HUMAN Purinergic receptor | Purinergic, P2X4
Type:
Enzyme Catalytic Domain
Mol. Mass.:
43374.70
Organism:
Homo sapiens (Human)
Description:
Purinergic, P2X4 0 HUMAN::Q99571
Residue:
388
  
Inhibitor
Name:
BDBM366066
Synonyms:
US9873683, Example 72
Type:
Small organic molecule
Emp. Form.:
C28H20N4O2
Mol. Mass.:
444.484
SMILES:
O=C1CC(=O)N(c2ccc(cc2)-c2nc[nH]c2-c2ccccc2)c2ccc3ccccc3c2N1
: