Target
3-phosphoinositide-dependent protein kinase 1 [51-360]
Ligand
BDBM366266
Substrate
Meas. Tech.
Kinase Assay
IC50
<500±n/a nM
Citation
 Lind, KECao, KLin, EYNguyen, TBTangonan, BTErlanson, DAGuckian, KSimmons, RLLee, WSun, LHansen, SPathan, NZhang, L Methods of treatment using pyridinonyl PDK1 inhibitors US Patent  US9873693 Publication Date 1/23/2018 
Target
Name:
3-phosphoinositide-dependent protein kinase 1 [51-360]
Synonyms:
3-phosphoinositide-dependent protein kinase 1 (PDK1) PDPK1 | PDPK1_HUMAN
Type:
Enzyme Catalytic Domain
Mol. Mass.:
35373.34
Organism:
Homo sapiens (Human)
Description:
(aa 51-360)
Residue:
310
  
Inhibitor
Name:
BDBM366266
Synonyms:
US9873693, Compound 189
Type:
Small organic molecule
Emp. Form.:
C30H23F3N4O6
Mol. Mass.:
592.522
SMILES:
CC(=O)Oc1ccc(cc1)C(COc1ccc2[nH]c(=O)[nH]c2c1)NC(=O)c1cccn(Cc2cc(F)c(F)c(F)c2)c1=O
: