Target
3-phosphoinositide-dependent protein kinase 1 [51-360]
Ligand
BDBM366378
Substrate
Meas. Tech.
Kinase Assay
IC50
<500±n/a nM
Citation
 Lind, KECao, KLin, EYNguyen, TBTangonan, BTErlanson, DAGuckian, KSimmons, RLLee, WSun, LHansen, SPathan, NZhang, L Methods of treatment using pyridinonyl PDK1 inhibitors US Patent  US9873693 Publication Date 1/23/2018 
Target
Name:
3-phosphoinositide-dependent protein kinase 1 [51-360]
Synonyms:
3-phosphoinositide-dependent protein kinase 1 (PDK1) PDPK1 | PDPK1_HUMAN
Type:
Enzyme Catalytic Domain
Mol. Mass.:
35373.34
Organism:
Homo sapiens (Human)
Description:
(aa 51-360)
Residue:
310
  
Inhibitor
Name:
BDBM366378
Synonyms:
US9873693, Compound 308
Type:
Small organic molecule
Emp. Form.:
C29H26F2N6O3S
Mol. Mass.:
576.617
SMILES:
CN(C)C(=O)CCC(NC(=O)c1cccn(Cc2ccc(F)c(F)c2)c1=O)c1nc(cs1)-c1c[nH]c2ncccc12
: