Target
Tyrosine-protein kinase JAK1
Ligand
BDBM366683
Substrate
Meas. Tech.
Enzyme Assay
Ki
0.300±n/a nM
Citation
 Ray, NCCheng, YEdwards, CGoodacre, SCLi, WPatel, SCartwright, MWSajad, MYuen, PZak, ME Triazolopyridine compounds, compositions and methods of use thereof US Patent  US9873709 Publication Date 1/23/2018 
Target
Name:
Tyrosine-protein kinase JAK1
Synonyms:
JAK-1 JAK1A JAK1_HUMAN Janus kinase 1 (JAK1) | Janus kinase 1 JAK1
Type:
Protein
Mol. Mass.:
133293.73
Organism:
Homo sapiens (Human)
Description:
P23458
Residue:
1154
  
Inhibitor
Name:
BDBM366683
Synonyms:
4-[[8-[4-(4- chlorophenyl)-4- (hydroxymethyl)-1- piperidyl]- [1,2,4]triazolo[1,5- a]pyridin-2-yl]amino]- N-(1-cyclopentyl-4- piperidyl)benzamide | US9873709, Example 1-280
Type:
Small organic molecule
Emp. Form.:
C35H42ClN7O2
Mol. Mass.:
628.207
SMILES:
OCC1(CCN(CC1)c1cccn2nc(Nc3ccc(cc3)C(=O)NC3CCN(CC3)C3CCCC3)nc12)c1ccc(Cl)cc1
: