Target
Tyrosine-protein kinase JAK2
Ligand
BDBM366685
Substrate
Meas. Tech.
Enzyme Assay
Ki
0.210±n/a nM
Citation
 Ray, NCCheng, YEdwards, CGoodacre, SCLi, WPatel, SCartwright, MWSajad, MYuen, PZak, ME Triazolopyridine compounds, compositions and methods of use thereof US Patent  US9873709 Publication Date 1/23/2018 
Target
Name:
Tyrosine-protein kinase JAK2
Synonyms:
JAK-2 JAK2_HUMAN Janus kinase 2 (JAK2) | Janus kinase 2 (a protein tyrosine kinase)
Type:
Protein
Mol. Mass.:
130684.68
Organism:
Homo sapiens (Human)
Description:
O60674
Residue:
1132
  
Inhibitor
Name:
BDBM366685
Synonyms:
US9873709, Example 1-282 | [4-[[8-[4-(4- chlorophenyl)-4- (hydroxymethyl)-1- piperidyl]- [1,2,4]triazolo[1,5- a]pyridin-2- yl]amino]phenyl]-[4- [(2R,6S)-2,6- dimethylmorpholin-4- yl]-1- piperidyl]methanone
Type:
Small organic molecule
Emp. Form.:
C36H44ClN7O3
Mol. Mass.:
658.233
SMILES:
C[C@H]1CN(C[C@@H](C)O1)C1CCN(CC1)C(=O)c1ccc(Nc2nc3c(cccn3n2)N2CCC(CO)(CC2)c2ccc(Cl)cc2)cc1
: