Target
Tyrosine-protein kinase JAK2
Ligand
BDBM367103
Substrate
Meas. Tech.
Enzyme Assay
Ki
0.290±n/a nM
Citation
 Ray, NCCheng, YEdwards, CGoodacre, SCLi, WPatel, SCartwright, MWSajad, MYuen, PZak, ME Triazolopyridine compounds, compositions and methods of use thereof US Patent  US9873709 Publication Date 1/23/2018 
Target
Name:
Tyrosine-protein kinase JAK2
Synonyms:
JAK-2 JAK2_HUMAN Janus kinase 2 (JAK2) | Janus kinase 2 (a protein tyrosine kinase)
Type:
Protein
Mol. Mass.:
130684.68
Organism:
Homo sapiens (Human)
Description:
O60674
Residue:
1132
  
Inhibitor
Name:
BDBM367103
Synonyms:
N-methyl-N-(3- pyridylmethyl)-4-[[8- [1-(4,4,4- trifluorobutanoyl)-3,6- dihydro-2H-pyridin-4- yl]-[1,2,4]triazolo[1,5- a]pyridin-2- yl]amino]benzamide | US9873709, Example 2-402
Type:
Small organic molecule
Emp. Form.:
C29H28F3N7O2
Mol. Mass.:
563.5735
SMILES:
CN(Cc1cccnc1)C(=O)c1ccc(Nc2nc3c(cccn3n2)C2=CCN(CC2)C(=O)CCC(F)(F)F)cc1
: