Target
Heat shock protein HSP 90-beta
Ligand
BDBM20743
Substrate
BDBM10852
Meas. Tech.
Her-2 Degradation Assay
pH
7.2±n/a
Temperature
310.15±n/a K
EC50
5000±n/a nM
Citation
 Biamonte, MAShi, JHong, KHurst, DCZhang, LFan, JBusch, DJKarjian, PLMaldonado, AASensintaffar, JLYang, YCKamal, ALough, RELundgren, KBurrows, FJTimony, GABoehm, MFKasibhatla, SR Orally active purine-based inhibitors of the heat shock protein 90. J Med Chem 49:817-28 (2006)  
Target
Name:
Heat shock protein HSP 90-beta
Synonyms:
HS90B_HUMAN HSP 90 HSP90B HSPCB Heat shock protein HSP 90 (Hsp90)
Type:
Molecular Chaperone
Mol. Mass.:
83229.45
Organism:
Homo sapiens (Human)
Description:
P08238
Residue:
724
  
Inhibitor
Name:
BDBM20743
Synonyms:
8-benzyladenine analogue, 12d | 9-butyl-8-[(2-iodo-5-methoxyphenyl)methyl]-9H-purin-6-amine
Type:
Small organic molecule
Emp. Form.:
C17H20IN5O
Mol. Mass.:
437.2781
SMILES:
CCCCn1c(Cc2cc(OC)ccc2I)nc2c(N)ncnc12
:
Substrate