Target
Fatty acid synthase
Ligand
BDBM244418
Substrate
Meas. Tech.
FASN Inhibition
IC50
9.00±n/a nM
Citation
 Heuer, TSOslob, JDMcDowell, RSJohnson, RYang, HEvanchik, MZaharia, CACai, HHu, LWDuke, GOhol-Gupta, YO Farrell, M Heterocyclic modulators of lipid synthesis and combinations thereof US Patent  US10226449 Publication Date 3/12/2019 
Target
Name:
Fatty acid synthase
Synonyms:
FAS FAS_HUMAN HU FASN
Type:
Enzyme
Mol. Mass.:
273419.37
Organism:
Homo sapiens (Human)
Description:
P49327
Residue:
2511
  
Inhibitor
Name:
BDBM244418
Synonyms:
US10226449, cpd 27 | US9428502, 27
Type:
Small organic molecule
Emp. Form.:
C25H25ClN4O2
Mol. Mass.:
448.945
SMILES:
COCc1nc(Cl)c([nH]1)-c1cc(ccc1C)C(=O)N1CCC(CC1)c1ccc(cc1)C#N
: