Target
Fatty acid synthase
Ligand
BDBM244434
Substrate
Meas. Tech.
FASN Inhibition
IC50
12.0±n/a nM
Citation
 Heuer, TSOslob, JDMcDowell, RSJohnson, RYang, HEvanchik, MZaharia, CACai, HHu, LWDuke, GOhol-Gupta, YO Farrell, M Heterocyclic modulators of lipid synthesis and combinations thereof US Patent  US10226449 Publication Date 3/12/2019 
Target
Name:
Fatty acid synthase
Synonyms:
FAS FAS_HUMAN HU FASN
Type:
Enzyme
Mol. Mass.:
273419.37
Organism:
Homo sapiens (Human)
Description:
P49327
Residue:
2511
  
Inhibitor
Name:
BDBM244434
Synonyms:
US10226449, cpd 43 | US9428502, 43
Type:
Small organic molecule
Emp. Form.:
C24H20ClFN4O
Mol. Mass.:
434.893
SMILES:
Cc1ccc(cc1-c1[nH]c(nc1Cl)C1CC1)C(=O)N1CC(F)(C1)c1ccc(cc1)C#N
: