Target
Fatty acid synthase
Ligand
BDBM244760
Substrate
Meas. Tech.
FASN Inhibition
IC50
12.0±n/a nM
Citation
 Heuer, TSOslob, JDMcDowell, RSJohnson, RYang, HEvanchik, MZaharia, CACai, HHu, LWDuke, GOhol-Gupta, YO Farrell, M Heterocyclic modulators of lipid synthesis and combinations thereof US Patent  US10226449 Publication Date 3/12/2019 
Target
Name:
Fatty acid synthase
Synonyms:
FAS FAS_HUMAN HU FASN
Type:
Enzyme
Mol. Mass.:
273419.37
Organism:
Homo sapiens (Human)
Description:
P49327
Residue:
2511
  
Inhibitor
Name:
BDBM244760
Synonyms:
US10226449, cpd 370 | US9428502, 370
Type:
Small organic molecule
Emp. Form.:
C24H20F4N4O
Mol. Mass.:
456.4354
SMILES:
Cc1nc(c([nH]1)-c1cc(C(=O)N2CC(F)(C2)c2ccc(cc2)C#N)c(C)cc1C)C(F)(F)F
: