Target
Acid ceramidase
Ligand
BDBM367228
Substrate
Meas. Tech.
Fluorescent-based In Vitro Assa
IC50
99.0±58 nM
Citation
 Piomelli, DPagliuca, CPizzirani, DBach, ARealini, NDe Vivo, M Benzoxazolone derivatives as acid ceramidase inhibitors, and their use as medicaments US Patent  US10226452 Publication Date 3/12/2019 
Target
Name:
Acid ceramidase
Synonyms:
ASAH ASAH1_HUMAN Acid ceramidase (AC)
Type:
Enzyme
Mol. Mass.:
44662.65
Organism:
Homo sapiens (Human)
Description:
Q13510
Residue:
395
  
Inhibitor
Name:
BDBM367228
Synonyms:
2-oxo-N-(6-phenylhexyl)-1,3- benzoxazole-3-carboxamide | US10226452, Example 58
Type:
Small organic molecule
Emp. Form.:
C20H22N2O3
Mol. Mass.:
338.4003
SMILES:
O=C(NCCCCCCc1ccccc1)n1c2ccccc2oc1=O
: