Target
Cyclin-dependent kinase 5 activator 1 [99-307]
Ligand
BDBM20819
Substrate
Histone H1
Meas. Tech.
CDK Inhibition Assay
pH
7.5±n/a
Temperature
298.15±n/a K
IC50
79±40 nM
Citation
 Rzasa, RMKaller, MRLiu, GMagal, ENguyen, TTOsslund, TDPowers, DSantora, VJViswanadhan, VNWang, HLXiong, XZhong, WNorman, MH Structure-activity relationships of 3,4-dihydro-1H-quinazolin-2-one derivatives as potential CDK5 inhibitors. Bioorg Med Chem 15:6574-95 (2007)  
Target
Name:
Cyclin-dependent kinase 5 activator 1 [99-307]
Synonyms:
CDK5/p25 | Cyclin-Dependent Kinase 5 (CDK5)
Type:
Protein Complex
Mol. Mass.:
Description:
Components:
This complex has 2 components.
Component 1
Name:
Cyclin-dependent kinase 5
Synonyms:
CDK5 CDKN5 Cyclin-dependent kinase 5 (CDK5/ p25) Cyclin-dependent-like kinase 5 PSSALRE Tau protein kinase II catalytic subunit
Type:
Enzyme Subunit
Mol. Mass.:
33308.61
Organism:
Homo sapiens (Human)
Description:
Residue:
292
  
Component 2
Name:
Cyclin-dependent kinase 5 activator 1 [99-307]
Synonyms:
CD5R1_HUMAN CDK5R1 Cyclin-dependent kinase 5 activator 1, p25 TPKII regulatory subunit | p25
Type:
Enzyme Subunit
Mol. Mass.:
23250.56
Organism:
Homo sapiens (Human)
Description:
Q15078 aa 99-307
Residue:
209
  
Inhibitor
Name:
BDBM20819
Synonyms:
3-[2-(pyridin-4-yl)-1,3-thiazol-4-yl]-1,2,3,4-tetrahydroquinazolin-2-one | dihydro-quinazolinone, 20a
Type:
Small organic molecule
Emp. Form.:
C16H12N4OS
Mol. Mass.:
308.358
SMILES:
O=C1Nc2ccccc2CN1c1csc(n1)-c1ccncc1
:
Substrate
Name:
Histone H1
Synonyms:
Type:
Other Protein Type
Mol. Mass.:
358.43
Organism:
Bos taurus (bovine)
Description:
Residue:
3
NA