Target
Nuclear factor NF-kappa-B p105 subunit
Ligand
BDBM367265
Substrate
Meas. Tech.
NF-keppaB GFP Assay
IC50
<3000±n/a nM
Citation
 Ouk, SLiou, H Small molecule NF-κB inhibitors US Patent  US10226464 Publication Date 3/12/2019 
Target
Name:
Nuclear factor NF-kappa-B p105 subunit
Synonyms:
NFKB1 Nuclear factor NF-kappa-B (NF-kB) Nuclear factor NF-kappa-B p105 subunit
Type:
Protein
Mol. Mass.:
105329.57
Organism:
Homo sapiens (Human)
Description:
P19838
Residue:
968
  
Inhibitor
Name:
BDBM367265
Synonyms:
US10226464, Compound 33
Type:
Small organic molecule
Emp. Form.:
C16H15FN2O4
Mol. Mass.:
318.2997
SMILES:
CC(C)CCOc1cc2oc3nc(=O)[nH]c(=O)c3cc2cc1F
: