Target
Nuclear factor NF-kappa-B p105 subunit
Ligand
BDBM367297
Substrate
Meas. Tech.
Electrophoretic Mobility Shift Assay (EMSA)
IC50
<1000±n/a nM
Citation
 Ouk, SLiou, H Small molecule NF-κB inhibitors US Patent  US10226464 Publication Date 3/12/2019 
Target
Name:
Nuclear factor NF-kappa-B p105 subunit
Synonyms:
NFKB1 Nuclear factor NF-kappa-B (NF-kB) Nuclear factor NF-kappa-B p105 subunit
Type:
Protein
Mol. Mass.:
105329.57
Organism:
Homo sapiens (Human)
Description:
P19838
Residue:
968
  
Inhibitor
Name:
BDBM367297
Synonyms:
US10226464, Compound 64
Type:
Small organic molecule
Emp. Form.:
C16H15ClN2O6
Mol. Mass.:
366.753
SMILES:
COCCOCCOc1cc2oc3nc(=O)[nH]c(=O)c3cc2cc1Cl
: