Target
Heat shock protein HSP 90-beta
Ligand
BDBM20898
Substrate
BDBM15527
Meas. Tech.
Fluorescence Polarization (FP) Assay and Cell Growth Inhibition (SRB) Assay
pH
7.4±n/a
Temperature
295.15±n/a K
IC50
1660±n/a nM
EC50
11370±n/a nM
Citation
 Brough, PAAherne, WBarril, XBorgognoni, JBoxall, KCansfield, JECheung, KMCollins, IDavies, NGDrysdale, MJDymock, BEccles, SAFinch, HFink, AHayes, AHowes, RHubbard, REJames, KJordan, AMLockie, AMartins, VMassey, AMatthews, TPMcDonald, ENorthfield, CJPearl, LHProdromou, CRay, SRaynaud, FIRoughley, SDSharp, SYSurgenor, AWalmsley, DLWebb, PWood, MWorkman, PWright, L 4,5-diarylisoxazole Hsp90 chaperone inhibitors: potential therapeutic agents for the treatment of cancer. J Med Chem 51:196-218 (2008)  
Target
Name:
Heat shock protein HSP 90-beta
Synonyms:
HS90B_HUMAN HSP 90 HSP90B HSPCB Heat shock protein HSP 90 (Hsp90)
Type:
Molecular Chaperone
Mol. Mass.:
83229.45
Organism:
Homo sapiens (Human)
Description:
P08238
Residue:
724
  
Inhibitor
Name:
BDBM20898
Synonyms:
3-(5-chloro-2,4-dihydroxyphenyl)-N-ethyl-4-(3-{[(2S)-2-(hydroxymethyl)pyrrolidin-1-yl]methyl}phenyl)-1H-pyrazole-5-carboxamide | Pyrazole, 20i
Type:
Small organic molecule
Emp. Form.:
C24H27ClN4O4
Mol. Mass.:
470.949
SMILES:
CCNC(=O)c1[nH]nc(c1-c1cccc(CN2CCC[C@H]2CO)c1)-c1cc(Cl)c(O)cc1O
:
Substrate
Name:
BDBM15527
Synonyms:
5-[({4-[3-(5-chloro-2,4-dihydroxyphenyl)-5-(ethylcarbamoyl)-1H-pyrazol-4-yl]phenyl}methyl)carbamoyl]-2-(6-hydroxy-3-oxo-3H-xanthen-9-yl)benzoic acid VER-00051001
Type:
Fluorescently labeled probe
Emp. Form.:
C40H29ClN4O9
Mol. Mass.:
745.133
SMILES:
CCNC(=O)c1[nH]nc(c1-c1ccc(CNC(=O)c2ccc(c(c2)C(O)=O)-c2c3ccc(O)cc3oc3cc(=O)ccc23)cc1)-c1cc(Cl)c(O)cc1O
: