Target
Histone deacetylase 6
Ligand
BDBM50398718
Substrate
Meas. Tech.
HDAC Inhibition Assays
IC50
60.3±15.8 nM
Citation
 Sotomayor, EMBergman, JAKozikowski, APVillagra, AVWoan, KV Selective histone deactylase 6 inhibitors US Patent  US10227295 Publication Date 3/12/2019 
Target
Name:
Histone deacetylase 6
Synonyms:
Cereblon/Histone deacetylase 6 HDAC6 Histone deacetylase 6 (HDAC6) KIAA0901 | ORF Names:JM21
Type:
Chromatin regulator; hydrolase; repressor
Mol. Mass.:
131381.51
Organism:
Homo sapiens (Human)
Description:
Q9UBN7
Residue:
1215
  
Inhibitor
Name:
BDBM50398718
Synonyms:
CHEMBL2179245 US9409858, 8b US9956192, Compound 8b
Type:
Small organic molecule
Emp. Form.:
C19H23N3O4
Mol. Mass.:
357.4036
SMILES:
COCCCN(C(=O)NCc1ccc(cc1)C(=O)NO)c1ccccc1
: