Target
Histone deacetylase 1
Ligand
BDBM239060
Substrate
Meas. Tech.
HDAC Inhibition Assays
IC50
579±n/a nM
Citation
 Sotomayor, EMBergman, JAKozikowski, APVillagra, AVWoan, KV Selective histone deactylase 6 inhibitors US Patent  US10227295 Publication Date 3/12/2019 
Target
Name:
Histone deacetylase 1
Synonyms:
Cereblon/Histone deacetylase 1 HDAC1 Histone deacetylase 1 (HDAC1) RPD3L1
Type:
Enzyme
Mol. Mass.:
55090.27
Organism:
Homo sapiens (Human)
Description:
Q13547
Residue:
482
  
Inhibitor
Name:
BDBM239060
Synonyms:
US10227295, Compound 9b US9751832, Compound 9b | US9956192, Compound 9b
Type:
Small organic molecule
Emp. Form.:
C15H16N4O3
Mol. Mass.:
300.3125
SMILES:
Cc1ccnc(NC(=O)NCc2ccc(cc2)C(=O)NO)c1
: