Target
Corticotropin-releasing factor receptor 1
Ligand
BDBM20959
Substrate
125I-Tyr(0)-ovine-CRF
Meas. Tech.
Receptor Binding Assay
pH
7±n/a
Temperature
295.15±n/a K
IC50
3.2±n/a nM
Citation
 Chen, YLBraselton, JForman, JGallaschun, RJMansbach, RSchmidt, AWSeeger, TFSprouse, JSTingley, FDWinston, ESchulz, DW Synthesis and SAR of 2-Aryloxy-4-alkoxy-pyridines as Potent Orally Active Corticotropin-Releasing Factor 1 Receptor Antagonists. J Med Chem 51:1377-84 (2008)  
Target
Name:
Corticotropin-releasing factor receptor 1
Synonyms:
CRF-R CRFR1_RAT Corticotropin releasing factor receptor Corticotropin-releasing Factor Receptor 1 Crhr | Crhr1
Type:
G Protein-Coupled Receptor (GPCR)
Mol. Mass.:
47870.75
Organism:
Rattus norvegicus (rat)
Description:
Receptor binding assays were performed using rat cortex homogenate.
Residue:
415
  
Inhibitor
Name:
BDBM20959
Synonyms:
2-Aryloxy-4-alkoxy-pyridine, 40 | 2-[4-(methoxymethyl)-2,6-dimethylphenoxy]-3,6-dimethyl-4-(pentan-3-yloxy)pyridine
Type:
Small organic molecule
Emp. Form.:
C22H31NO3
Mol. Mass.:
357.4864
SMILES:
CCC(CC)Oc1cc(C)nc(Oc2c(C)cc(COC)cc2C)c1C
:
Substrate
Name:
125I-Tyr(0)-ovine-CRF
Synonyms:
Ovine Tyr-CRF | oCRF
Type:
radiolabeled substrate
Mol. Mass.:
4833.46
Organism:
Ovis aries (sheep)
Description:
Residue:
42