Target
Interleukin-17A
Ligand
BDBM247034
Substrate
Meas. Tech.
Human TH17 Cytokine Inhibition ELISA Assay
IC50
>10000±n/a nM
Citation
 Gaweco, ATilley, JBlinn, J Sulfonamide retinoic acid receptor-related orphan receptor modulators and uses thereof US Patent  US9701663 Publication Date 7/11/2017 
Target
Name:
Interleukin-17A
Synonyms:
CTLA8 IL-17 IL17A il-17a
Type:
Enzyme Catalytic Domain
Mol. Mass.:
17511.44
Organism:
Homo sapiens (Human)
Description:
Q16552
Residue:
155
  
Inhibitor
Name:
BDBM247034
Synonyms:
1-((1-(methylsulfonyl)piperidin-4-yl)methyl)-5-(1H-pyrazol-4-yl)-1H-indole | US9701663, 50
Type:
Small organic molecule
Emp. Form.:
C18H22N4O2S
Mol. Mass.:
358.458
SMILES:
CS(=O)(=O)N1CCC(Cn2ccc3cc(ccc23)-c2cn[nH]c2)CC1
: