Target
Procathepsin L
Ligand
BDBM21005
Substrate
BDBM20994
Meas. Tech.
Enzyme Inhibition Assay
pH
5.5±n/a
Temperature
298.15±n/a K
Ki
460±n/a nM
Citation
 Chowdhury, SFJoseph, LKumar, STulsidas, SRBhat, SZiomek, EMénard, RSivaraman, JPurisima, EO Exploring inhibitor binding at the s' subsites of cathepsin L. J Med Chem 51:1361-8 (2008)  
Target
Name:
Procathepsin L
Synonyms:
CATL1_HUMAN CTSL CTSL1 Cathepsin L Cathepsin L1 heavy chain MEP cathepsin L preproprotein
Type:
Enzyme
Mol. Mass.:
37557.19
Organism:
Homo sapiens (Human)
Description:
Purchased from Calbiochem (San Diego, CA).
Residue:
333
  
Inhibitor
Name:
BDBM21005
Synonyms:
(2R)-5-[(diaminomethylidene)amino]-N-[(1S)-2-phenyl-1-[(2-phenylethyl)carbamoyl]ethyl]-2-[(2S)-2-[1-(4-phenylphenyl)acetamido]pentanamido]pentanamide | Tripeptide derivative, 13
Type:
Small organic molecule
Emp. Form.:
C42H51N7O4
Mol. Mass.:
717.8988
SMILES:
[#6]-[#6]-[#6]-[#6@H](-[#7]-[#6](=O)-[#6]-c1ccc(cc1)-c1ccccc1)-[#6](=O)-[#7]-[#6@H](-[#6]-[#6]-[#6]\[#7]=[#6](/[#7])-[#7])-[#6](=O)-[#7]-[#6@@H](-[#6]-c1ccccc1)-[#6](=O)-[#7]-[#6]-[#6]-c1ccccc1
:
Substrate
Name:
BDBM20994
Synonyms:
Cbz-Phe-Arg-MCA benzyloxycarbonyl-L-phenylalanyl-L-arginine 4-methylcoumarinyl-7-amide hydrochloride
Type:
Emp. Form.:
Mol. Mass.:
SMILES:
: