Target
Delta-type opioid receptor
Ligand
BDBM21009
Substrate
BDBM21008
Meas. Tech.
Radioligand Labeled Binding Assay and [35S]GTP-gamma-S Binding Assay
pH
7.4±n/a
Temperature
298.15±n/a K
Ki
31±n/a nM
EC50
85±n/a nM
Citation
 Yamamoto, TNair, PVagner, JLargent-Milnes, TDavis, PMa, SWNavratilova, EMoye, STumati, SLai, JYamamura, HIVanderah, TWPorreca, FHruby, VJ A Structure-Activity Relationship Study and Combinatorial Synthetic Approach of C-Terminal Modified Bifunctional Peptides That Are delta/mu Opioid Receptor Agonists and Neurokinin 1 Receptor Antagonists. J Med Chem 51:1369-76 (2008)  
Target
Name:
Delta-type opioid receptor
Synonyms:
D-OR-1 Delta opioid receptor OPIATE Delta OPRD1 OPRK1 | opioid receptor, delta 1
Type:
G Protein-Coupled Receptor (GPCR)
Mol. Mass.:
40382.98
Organism:
Homo sapiens (Human)
Description:
Competition binding assays were carried out using membrane preparations from transfected HN9.10 cells that constitutively expressed the delta opioid receptor.
Residue:
372
  
Inhibitor
Name:
BDBM21009
Synonyms:
C-terminal modified bifunctional peptide, 2 benzyl (2S)-2-[(2S)-2-{[(2S)-1-[(2S)-2-{2-[(2R)-2-[(2S)-2-amino-3-(4-hydroxyphenyl)propanamido]propanamido]acetamido}-3-phenylpropanoyl]pyrrolidin-2-yl]formamido}-4-methylpentanamido]-3-(1H-indol-3-yl)propanoate
Type:
Peptide-like ligand
Emp. Form.:
C52H62N8O9
Mol. Mass.:
943.0969
SMILES:
CC(C)C[C@H](NC(=O)[C@@H]1CCCN1C(=O)[C@H](Cc1ccccc1)NC(=O)CNC(=O)[C@@H](C)NC(=O)[C@@H](N)Cc1ccc(O)cc1)C(=O)N[C@@H](Cc1c[nH]c2ccccc12)C(=O)OCc1ccccc1
:
Substrate
Name:
BDBM21008
Synonyms:
(4S,7S,13S)-13-[(2S)-2-amino-3-(4-hydroxyphenyl)propanamido]-7-benzyl-3,3,14,14-tetramethyl-6,9,12-trioxo-1,2-dithia-5,8,11-triazacyclotetradecane-4-carboxylic acid DPDPE DPDPE-OH [3H]DPDPE
Type:
Analgesics
Emp. Form.:
C30H39N5O7S2
Mol. Mass.:
645.79
SMILES:
CC1(C)SSC(C)(C)[C@@H](NC(=O)[C@@H](N)Cc2ccc(O)cc2)C(=O)NCC(=O)N[C@@H](Cc2ccccc2)C(=O)N[C@H]1C(O)=O
: