Target
Mu-type opioid receptor
Ligand
BDBM21014
Substrate
BDBM21015
Meas. Tech.
Radioligand Labeled Binding Assay
pH
7.4±n/a
Temperature
298.15±n/a K
Ki
1.4±n/a nM
Citation
 Yamamoto, TNair, PVagner, JLargent-Milnes, TDavis, PMa, SWNavratilova, EMoye, STumati, SLai, JYamamura, HIVanderah, TWPorreca, FHruby, VJ A Structure-Activity Relationship Study and Combinatorial Synthetic Approach of C-Terminal Modified Bifunctional Peptides That Are delta/mu Opioid Receptor Agonists and Neurokinin 1 Receptor Antagonists. J Med Chem 51:1369-76 (2008)  
Target
Name:
Mu-type opioid receptor
Synonyms:
MOR-1 Mu-type opioid receptor (MOR) OPRM_RAT Opioid receptor B Ror-b
Type:
G Protein-Coupled Receptor (GPCR)
Mol. Mass.:
44503.11
Organism:
Rattus norvegicus (rat)
Description:
Competition binding assays were carried out using membrane preparations from transfected HN9.10 cells that constitutively expressed the mu opioid receptor.
Residue:
398
  
Inhibitor
Name:
BDBM21014
Synonyms:
(2S)-2-amino-N-[(1R)-1-[({[(1S)-1-{N'-[(2S)-2-{2-[(2R)-2-[(2S)-2-amino-3-(4-hydroxyphenyl)propanamido]propanamido]acetamido}-3-phenylpropanoyl]hydrazinecarbonyl}-2-phenylethyl]carbamoyl}methyl)carbamoyl]ethyl]-3-(4-hydroxyphenyl)propanamide Biphalin bis(Tyr-Ala-Gly-PheNH2)hydrazide | enkephalin dimer
Type:
Analgesics
Emp. Form.:
C46H56N10O10
Mol. Mass.:
908.9978
SMILES:
C[C@@H](NC(=O)[C@@H](N)Cc1ccc(O)cc1)C(=O)NCC(=O)N[C@@H](Cc1ccccc1)C(=O)NNC(=O)[C@H](Cc1ccccc1)NC(=O)CNC(=O)[C@@H](C)NC(=O)[C@@H](N)Cc1ccc(O)cc1
:
Substrate
Name:
BDBM21015
Synonyms:
(2S)-2-{2-[(2R)-2-[(2S)-2-amino-3-(4-hydroxyphenyl)propanamido]propanamido]-N-methylacetamido}-N-(2-hydroxyethyl)-3-phenylpropanamide CHEMBL38874 DAMGO US11492374, ID 2 [tyrosyl-3,5-3H(N)]-D-Ala2-Mephe4-glyol5-enkephalin
Type:
Analgesics
Emp. Form.:
C26H35N5O6
Mol. Mass.:
513.586
SMILES:
C[C@@H](NC(=O)[C@@H](N)Cc1ccc(O)cc1)C(=O)NCC(=O)N(C)[C@@H](Cc1ccccc1)C(=O)NCCO
: