Target
Ghrelin O-acyltransferase
Ligand
BDBM367610
Substrate
Meas. Tech.
Human GOAT Enzymatic Assay
IC50
54.4±n/a nM
Citation
 Galka, CSHembre, EJHonigschmidt, NAMartinez-Grau, MAPlaza, GRRubio, AKeding, SJSmith, DL Ghrelin 0-acyl transferase inhibitors US Patent  US10227310 Publication Date 3/12/2019 
Target
Name:
Ghrelin O-acyltransferase
Synonyms:
GOAT MBOA4_HUMAN Membrane-bound O-acyltransferase domain-containing protein 4 OACT4
Type:
Enzyme
Mol. Mass.:
49733.10
Organism:
Homo sapiens (Human)
Description:
Q96T53
Residue:
435
  
Inhibitor
Name:
BDBM367610
Synonyms:
N-[(1S)-2-[4-[2- (4-Amino-2- chloro-6-methyl- pyrimidin-5-yl) ethyl]-1-piperidyl]-1- methyl-2-oxo-ethyl]-5- methyl-1H-pyrazole- 4-carboxamide | US10227310, Example 2
Type:
Small organic molecule
Emp. Form.:
C20H28ClN7O2
Mol. Mass.:
433.935
SMILES:
C[C@H](NC(=O)c1cn[nH]c1C)C(=O)N1CCC(CCc2c(C)nc(Cl)nc2N)CC1
: