Target
Ghrelin O-acyltransferase
Ligand
BDBM367614
Substrate
Meas. Tech.
Human GOAT Enzymatic Assay
IC50
170±103 nM
Citation
 Galka, CSHembre, EJHonigschmidt, NAMartinez-Grau, MAPlaza, GRRubio, AKeding, SJSmith, DL Ghrelin 0-acyl transferase inhibitors US Patent  US10227310 Publication Date 3/12/2019 
Target
Name:
Ghrelin O-acyltransferase
Synonyms:
GOAT MBOA4_HUMAN Membrane-bound O-acyltransferase domain-containing protein 4 OACT4
Type:
Enzyme
Mol. Mass.:
49733.10
Organism:
Homo sapiens (Human)
Description:
Q96T53
Residue:
435
  
Inhibitor
Name:
BDBM367614
Synonyms:
N-[(1S)-2-[4-[2-(4-Amino-6-chloro-2-methyl-pyrimidin-5-yl)ethyl]-1-piperidyl]-1-methyl-2-oxo-ethyl]acetamide | US10227310, Example 69
Type:
Small organic molecule
Emp. Form.:
C17H26ClN5O2
Mol. Mass.:
367.874
SMILES:
C[C@H](NC(C)=O)C(=O)N1CCC(CCc2c(N)nc(C)nc2Cl)CC1
: