Target
Mast/stem cell growth factor receptor Kit
Ligand
BDBM21075
Substrate
biotinylated peptide substrate
Meas. Tech.
HTRF Assay of Receptor Tyrosine Kinase and Cellular KDR Phosphorylation Assay
IC50
23±n/a nM
Citation
 Ji, ZAhmed, AAAlbert, DHBouska, JJBousquet, PFCunha, GADiaz, GGlaser, KBGuo, JHarris, CMLi, JMarcotte, PAMoskey, MDOie, TPease, LSoni, NBStewart, KDDavidsen, SKMichaelides, MR 3-Amino-benzo[d]isoxazoles as Novel Multitargeted Inhibitors of Receptor Tyrosine Kinases. J Med Chem 51:1231-41 (2008)  
Target
Name:
Mast/stem cell growth factor receptor Kit
Synonyms:
CD117 antigen KIT Mast/stem cell growth factor receptor Kit (cKIT) Proto-oncogene tyrosine-protein kinase Kit Stem cell growth factor receptor Tyrosine-protein kinase Kit c-kit v-kit Hardy-Zuckerman 4 feline sarcoma viral oncogene homolog
Type:
Protein
Mol. Mass.:
109869.37
Organism:
Homo sapiens (Human)
Description:
P10721
Residue:
976
  
Inhibitor
Name:
BDBM21075
Synonyms:
3-[4-(3-amino-1,2-benzoxazol-4-yl)phenyl]-1-(2-fluoro-5-methylphenyl)urea | Aminobenzoisoxazole, 13
Type:
Small organic molecule
Emp. Form.:
C21H17FN4O2
Mol. Mass.:
376.3837
SMILES:
Cc1ccc(F)c(NC(=O)Nc2ccc(cc2)-c2cccc3onc(N)c23)c1
:
Substrate
Name:
biotinylated peptide substrate
Synonyms:
Type:
Peptide
Mol. Mass.:
2470.20
Organism:
Description:
Residue:
21