Target
Mast/stem cell growth factor receptor Kit
Ligand
BDBM21106
Substrate
biotinylated peptide substrate
Meas. Tech.
HTRF Assay of Receptor Tyrosine Kinase
IC50
23±n/a nM
Citation
 Ji, ZAhmed, AAAlbert, DHBouska, JJBousquet, PFCunha, GADiaz, GGlaser, KBGuo, JHarris, CMLi, JMarcotte, PAMoskey, MDOie, TPease, LSoni, NBStewart, KDDavidsen, SKMichaelides, MR 3-Amino-benzo[d]isoxazoles as Novel Multitargeted Inhibitors of Receptor Tyrosine Kinases. J Med Chem 51:1231-41 (2008)  
Target
Name:
Mast/stem cell growth factor receptor Kit
Synonyms:
CD117 antigen KIT Mast/stem cell growth factor receptor Kit (cKIT) Proto-oncogene tyrosine-protein kinase Kit Stem cell growth factor receptor Tyrosine-protein kinase Kit c-kit v-kit Hardy-Zuckerman 4 feline sarcoma viral oncogene homolog
Type:
Protein
Mol. Mass.:
109869.37
Organism:
Homo sapiens (Human)
Description:
P10721
Residue:
976
  
Inhibitor
Name:
BDBM21106
Synonyms:
3-[4-(3-amino-7-methoxy-1,2-benzoxazol-4-yl)phenyl]-1-(3-bromophenyl)urea | Aminobenzoisoxazole, 52
Type:
Small organic molecule
Emp. Form.:
C21H17BrN4O3
Mol. Mass.:
453.289
SMILES:
COc1ccc(-c2ccc(NC(=O)Nc3cccc(Br)c3)cc2)c2c(N)noc12
:
Substrate
Name:
biotinylated peptide substrate
Synonyms:
Type:
Peptide
Mol. Mass.:
2470.20
Organism:
Description:
Residue:
21