Target
Aromatase
Ligand
BDBM21093
Substrate
biotinylated peptide substrate
Meas. Tech.
HTRF Assay of Receptor Tyrosine Kinase
IC50
4±n/a nM
Citation
 Ji, ZAhmed, AAAlbert, DHBouska, JJBousquet, PFCunha, GADiaz, GGlaser, KBGuo, JHarris, CMLi, JMarcotte, PAMoskey, MDOie, TPease, LSoni, NBStewart, KDDavidsen, SKMichaelides, MR 3-Amino-benzo[d]isoxazoles as Novel Multitargeted Inhibitors of Receptor Tyrosine Kinases. J Med Chem 51:1231-41 (2008)  
Target
Name:
Aromatase
Synonyms:
ARO1 CP19A_HUMAN CYP19 CYPXIX Cytochrome P450 19A1 Cytochrome P450-C19 (CYP19) FL cytokine receptor precursor | P-450AROM
Type:
Enzyme
Mol. Mass.:
57888.92
Organism:
Homo sapiens (Human)
Description:
P11511
Residue:
503
  
Inhibitor
Name:
BDBM21093
Synonyms:
3-[4-(3-amino-1,2-benzoxazol-4-yl)phenyl]-1-(4-fluorophenyl)urea | Aminobenzoisoxazole, 36
Type:
Small organic molecule
Emp. Form.:
C20H15FN4O2
Mol. Mass.:
362.3571
SMILES:
Nc1noc2cccc(-c3ccc(NC(=O)Nc4ccc(F)cc4)cc3)c12
:
Substrate
Name:
biotinylated peptide substrate
Synonyms:
Type:
Peptide
Mol. Mass.:
2470.20
Organism:
Description:
Residue:
21