Target
Proto-oncogene tyrosine-protein kinase receptor Ret
Ligand
BDBM367710
Substrate
Meas. Tech.
RET Wild Type Assay at KM
IC50
<10±n/a nM
Citation
 Brubaker, JDGuzi, TWilson, KJDipietro, LVZhang, YWilson, DFleming, PE Compounds useful for treating disorders related to RET US Patent  US10227329 Publication Date 3/12/2019 
Target
Name:
Proto-oncogene tyrosine-protein kinase receptor Ret
Synonyms:
CDHF12 Cadherin family member 12 Proto-oncogene c-Ret RET51 Tyrosine-protein kinase Ret (RET)
Type:
Protein
Mol. Mass.:
124318.29
Organism:
Homo sapiens (Human)
Description:
P07949
Residue:
1114
  
Inhibitor
Name:
BDBM367710
Synonyms:
US10227329, Compound 122
Type:
Small organic molecule
Emp. Form.:
C23H25FN10O
Mol. Mass.:
476.5094
SMILES:
C[C@H](NC(=O)C1(F)CN(C1)c1nc(C)cc(Nc2cc(C)[nH]n2)n1)c1ccc(nc1)-n1cccn1
: