Target
Metallo-beta-lactamase type 2
Ligand
BDBM367839
Substrate
Meas. Tech.
Enzyme Activity
IC50
0.029±n/a nM
Citation
 Bennett, FJiang, JPasternak, ADong, SGu, XScott, JDTang, HZhao, ZHuang, YHunter, DYang, DYoung, KXiao, LZhang, ZFu, JBai, YZheng, ZZhang, X Metallo-beta-lactamase inhibitors US Patent  US10227331 Publication Date 3/12/2019 
Target
Name:
Metallo-beta-lactamase type 2
Synonyms:
B2 metallo-beta-lactamase Beta-lactamase NDM-1 Metallo-beta-lactamase NDM-1 Metallo-beta-lactamase type II New Delhi metallo-beta-lactamase-1 | blaNDM-1
Type:
PROTEIN
Mol. Mass.:
28498.15
Organism:
Klebsiella pneumoniae
Description:
ChEMBL_103887
Residue:
270
  
Inhibitor
Name:
BDBM367839
Synonyms:
(2-amino-3- cyanophenyl) boronic acid US10544130, Example 11
Type:
Small organic molecule
Emp. Form.:
C7H7BN2O2
Mol. Mass.:
161.954
SMILES:
Nc1c(cccc1B(O)O)C#N
: