Target
Estrogen receptor
Ligand
BDBM368199
Substrate
Meas. Tech.
Breast Cancer Cell Viability Assay
IC50
0.070±n/a nM
Citation
 Kahraman, MGovek, SPSmith, NDHager, JHChow Maneval, E Estrogen receptor modulators and uses thereof US Patent  US10227334 Publication Date 3/12/2019 
Target
Name:
Estrogen receptor
Synonyms:
ER ESR ESR1_HUMAN Estrogen receptor Estrogen receptor (ER-alpha) Estrogen receptor alpha (ER) Nuclear receptor subfamily 3 group A member 1
Type:
Protein
Mol. Mass.:
66230.44
Organism:
Homo sapiens (Human)
Description:
P03372
Residue:
595
  
Inhibitor
Name:
BDBM368199
Synonyms:
(S)-2-(4-(2-(3-(fluoromethyl)azetidin-1-yl)ethoxy)phenyl)-3-(3-hydroxyphenyl)-4-methyl-2H-chromen-6-ol | US10227334, Example 3
Type:
Small organic molecule
Emp. Form.:
C28H28FNO4
Mol. Mass.:
461.5246
SMILES:
CC1=C([C@@H](Oc2ccc(O)cc12)c1ccc(OCCN2CC(CF)C2)cc1)c1cccc(O)c1
: