Target
Cytochrome P450 3A4
Ligand
BDBM21167
Substrate
BDBM21150
Meas. Tech.
CYP3A4 Enzyme Inhibition Assay
pH
7.4±n/a
Temperature
310.15±n/a K
IC50
7700±900 nM
Citation
 Ahlström, MMZamora, I Characterization of Type II Ligands in CYP2C9 and CYP3A4. J Med Chem 51:1755-1763 (2008)  
Target
Name:
Cytochrome P450 3A4
Synonyms:
Albendazole monooxygenase CP3A4_HUMAN CYP3A4 CYPIIIA4 Cytochrome P450 3A4 (CYP3A4) Nifedipine oxidase Taurochenodeoxycholate 6-alpha-hydroxylase
Type:
Enzyme
Mol. Mass.:
57349.57
Organism:
Homo sapiens (Human)
Description:
Residue:
503
  
Inhibitor
Name:
BDBM21167
Synonyms:
Triazole-based ligand, 18 | [2-(2,4-dichlorophenyl)-2-(1H-1,2,4-triazol-1-ylmethyl)-1,3-dioxolan-4-yl]methyl methanesulfonate
Type:
Small organic molecule
Emp. Form.:
C14H15Cl2N3O5S
Mol. Mass.:
408.257
SMILES:
CS(=O)(=O)OCC1COC(Cn2cncn2)(O1)c1ccc(Cl)cc1Cl
:
Substrate
Name:
BDBM21150
Synonyms:
7-(benzyloxy)-4-(trifluoromethyl)-2H-chromen-2-one 7-benzyloxy-4-trifluoromethylcoumarin | BFC
Type:
Small organic molecule
Emp. Form.:
C17H11F3O3
Mol. Mass.:
320.2626
SMILES:
FC(F)(F)c1cc(=O)oc2cc(OCc3ccccc3)ccc12
: