Target
Cytochrome P450 2C9
Ligand
BDBM21159
Substrate
BDBM21171
Meas. Tech.
CYP3A4 Enzyme Inhibition Assay
IC50
21000±n/a nM
Citation
 Ahlström, MMZamora, I Characterization of Type II Ligands in CYP2C9 and CYP3A4. J Med Chem 51:1755-1763 (2008)  
Target
Name:
Cytochrome P450 2C9
Synonyms:
(R)-limonene 6-monooxygenase CP2C9_HUMAN CYP2C9 Cytochrome P450 2C9 (CYP2C9 ) P-450MP P450 PB-1 | S-mephenytoin 4-hydroxylase
Type:
Enzyme
Mol. Mass.:
55636.33
Organism:
Homo sapiens (Human)
Description:
P11712
Residue:
490
  
Inhibitor
Name:
BDBM21159
Synonyms:
N-[(5-methylpyrimidin-2-yl)methyl]-6-phenyl-2-(pyridin-3-yl)pyrimidin-4-amine | Pyridine-based ligand, 10
Type:
Small organic molecule
Emp. Form.:
C21H18N6
Mol. Mass.:
354.4078
SMILES:
Cc1cnc(CNc2cc(nc(n2)-c2cccnc2)-c2ccccc2)nc1
:
Substrate
Name:
BDBM21171
Synonyms:
7-methoxy-4-(trifluoromethyl)-2H-chromen-2-one MFC
Type:
Small organic molecule
Emp. Form.:
C11H7F3O3
Mol. Mass.:
244.1667
SMILES:
COc1ccc2c(cc(=O)oc2c1)C(F)(F)F
: