Target
Cytochrome P450 2C9
Ligand
BDBM21166
Substrate
BDBM21171
Meas. Tech.
CYP3A4 Enzyme Inhibition Assay
IC50
>50000±n/a nM
Citation
 Ahlström, MMZamora, I Characterization of Type II Ligands in CYP2C9 and CYP3A4. J Med Chem 51:1755-1763 (2008)  
Target
Name:
Cytochrome P450 2C9
Synonyms:
(R)-limonene 6-monooxygenase CP2C9_HUMAN CYP2C9 Cytochrome P450 2C9 (CYP2C9 ) P-450MP P450 PB-1 | S-mephenytoin 4-hydroxylase
Type:
Enzyme
Mol. Mass.:
55636.33
Organism:
Homo sapiens (Human)
Description:
P11712
Residue:
490
  
Inhibitor
Name:
BDBM21166
Synonyms:
1-{[2-(2,4-dichlorophenyl)-4-ethyl-1,3-dioxolan-2-yl]methyl}-1H-1,2,4-triazole | Triazole-based ligand, 17
Type:
Small organic molecule
Emp. Form.:
C14H15Cl2N3O2
Mol. Mass.:
328.194
SMILES:
CCC1COC(Cn2cncn2)(O1)c1ccc(Cl)cc1Cl
:
Substrate
Name:
BDBM21171
Synonyms:
7-methoxy-4-(trifluoromethyl)-2H-chromen-2-one MFC
Type:
Small organic molecule
Emp. Form.:
C11H7F3O3
Mol. Mass.:
244.1667
SMILES:
COc1ccc2c(cc(=O)oc2c1)C(F)(F)F
: