Target
Sodium channel protein type 5 subunit alpha
Ligand
BDBM368308
Substrate
Meas. Tech.
Measurement of Sodium Ion Channel Blocking Effects
IC50
8200±n/a nM
Citation
 Lee, HKim, IJung, MKim, HSLee, CHJun, SAYoon, JSKim, S Substituted benzenesulfonamides as sodium channel blockers US Patent  US10227338 Publication Date 3/12/2019 
Target
Name:
Sodium channel protein type 5 subunit alpha
Synonyms:
HH1 SCN5A_HUMAN Sodium channel protein type 5 subunit alpha/beta-1/beta-2 Voltage-gated sodium channel subunit alpha Nav1.5
Type:
Enzyme
Mol. Mass.:
226908.60
Organism:
Homo sapiens (Human)
Description:
Q14524
Residue:
2016
  
Inhibitor
Name:
BDBM368308
Synonyms:
US10227338, Example 95
Type:
Small organic molecule
Emp. Form.:
C20H20ClF4N5O2S2
Mol. Mass.:
537.982
SMILES:
CNCCN(C)c1cc(ccc1Nc1cc(F)c(cc1Cl)S(=O)(=O)Nc1cscn1)C(F)(F)F
: