Target
Proto-oncogene tyrosine-protein kinase Src
Ligand
BDBM247086
Substrate
Meas. Tech.
c-Src Enzyme Inhibition 1
IC50
1.000±n/a nM
Citation
 Cariou, CACharron, CEFordyce, EAHamza, DFyfe, MCIto, KKing-Underwood, JMurray, PJOnions, STThom, SMWatson, HTWilliams, JG Pyrazolyl-ureas as kinase inhibitors US Patent  US9701670 Publication Date 7/11/2017 
Target
Name:
Proto-oncogene tyrosine-protein kinase Src
Synonyms:
Calmodulin/Proto-oncogene tyrosine-protein kinase Src Proto-oncogene c-Src SRC SRC_HUMAN V-src sarcoma (Schmidt-Ruppin A-2) viral oncogene homolog (avian) p60-Src | pp60c-src
Type:
Protein
Mol. Mass.:
59838.60
Organism:
Homo sapiens (Human)
Description:
P12931
Residue:
536
  
Inhibitor
Name:
BDBM247086
Synonyms:
3-((4-((4-(3-(3-isopropyl-1-(p-tolyl)-1H-pyrazol-5-yl)ureido)naphthalen-1-yl)oxy)pyrimidin-2-yl)amino)-4-methoxy-N-(2-morpholinoethyl)benzamide | US9701670, 30
Type:
Small organic molecule
Emp. Form.:
C42H45N9O5
Mol. Mass.:
755.864
SMILES:
COc1ccc(cc1Nc1nccc(Oc2ccc(NC(=O)Nc3cc(nn3-c3ccc(C)cc3)C(C)C)c3ccccc23)n1)C(=O)NCCN1CCOCC1
: